BDBM35168 indazole-benzimidazole, 4
SMILES CN1CCN(CC1)c1cccc2[nH]c(nc12)-c1n[nH]c2cc(ccc12)-c1ccc(O)cc1
InChI Key InChIKey=IAHVSHNBRRKKBX-UHFFFAOYSA-N
Data  2 IC50
  Tab Delimited (TSV)   2D SDfile   Computed 3D by Vconf -m prep SDfile
Find this compound or compounds like it in BindingDB:
Activity Spreadsheet -- Enzyme Inhibition Constant Data from BindingDB
Found 1 hit for monomerid = 35168
TargetCyclin-A2 [177-432]/Cyclin-dependent kinase 2(Homo sapiens (Human))
Pfizer
LigandPNGBDBM35168(indazole-benzimidazole, 4)
Affinity DataIC50:  13.3nMT: 2°C. Assay description: Active cyclin dependent kinase 2 (CDK2) activity was determined by measuring the phosphorylation of Histone type 3 (Sigma H5505), in the presence of ...
In DepthDetails ArticlePubMed